BDBM50230673 CHEMBL3351015
SMILES [H][C@](Cc1c[nH]c2ccccc12)(NC(=O)O[C@H]1CC2CCC1(C)C2(C)C)C(=O)NC[C@H](NC(=O)\C=C\C(O)=O)c1ccccc1
InChI Key InChIKey=NAXBVEBGKWEYFZ-LBSRDDFSSA-N
Data  1 KI
  Tab Delimited (TSV)   2D SDfile   Computed 3D by Vconf -m prep SDfile
Find this compound or compounds like it in BindingDB:
Activity Spreadsheet -- Enzyme Inhibition Constant Data from BindingDB
Found 1 hit for monomerid = 50230673
TargetGastrin/cholecystokinin type B receptor(MOUSE)
Parke-Davis Neuroscience Research Centre
Curated by ChEMBL
LigandPNGBDBM50230673(CHEMBL3351015)
Affinity DataKi:  81nM. Assay description: Cholecystokinin type B receptor binding assay performed on homogenized cerebral cortex from male mouse
In DepthDetails ArticlePubMed